Commit: Gitlab Phileas Core TMS 18.0:240c3326  
Subject: Sync to github
Author: Yann Le Doaré
Committer: Yann Le Doaré
Commit: Gitlab Phileas Community 18.0:e166bb35  
Subject: Add account_dashboard_banner
Author: Yann Le Doaré
Committer: Yann Le Doaré
Commit: Gitlab Phileas Common modules 18.0:2a0e0b3d  
Subject: Clean xml_search_improved
Author: Yann Le Doaré
Committer: Yann Le Doaré
Commit: Gitlab Phileas Odoo 18.0:71e0751f  
Subject: Disable data demo for fleet module
Author: Yann Le Doaré
Committer: Yann Le Doaré
Commit: OS4B raud:42f5d9b5  
Subject: Updated
Author: Yann Le Doaré
Committer: Yann Le Doaré
Version: master
Config: Default
Build time: 120s
Wait time: 122s
Load time: 2m
Date Level Type Message
2026-08-31 13:15:33 INFO runbot Init build environment with config Default
2026-08-31 13:15:33 Starting step base from config Default
2026-08-31 13:15:33 Using Dockerfile Tag odoo:minimal_18_0
2026-08-31 13:15:59 INFO server odoo.modules.loading:360 1 modules loaded in 12.15s, 8884 queries (+8884 extra)
2026-08-31 13:16:08 INFO server odoo.modules.loading:360 13 modules loaded in 7.61s, 4198 queries (+4198 extra)
2026-08-31 13:16:11 INFO runbot Getting results for build 00361-master
2026-08-31 13:16:11 Step base finished in 36s
2026-08-31 13:16:11 Starting step all from config Default
2026-08-31 13:16:11 Using Dockerfile Tag odoo:minimal_18_0
2026-08-31 13:17:29 INFO server odoo.modules.loading:360 1 modules loaded in 67.09s, 8884 queries (+36543 extra)
2026-08-31 13:17:31 WARNING server odoo.modules.loading:647 Transient module states were reset
2026-08-31 13:17:31 ERROR server odoo.modules.registry:134 Failed to load registry
2026-08-31 13:17:31 CRITICAL server odoo.service.server:1404
Failed to initialize database `00361-master-all`.
Traceback (most recent call last):
  File "/usr/lib/python3.12/importlib/metadata/__init__.py", line 397, in from_name
    return next(cls.discover(name=name))
           ^^^^^^^^^^^^^^^^^^^^^^^^^^^^^
StopIteration

During handling of the above exception, another exception occurred:

Traceback (most recent call last):
  File "/data/build/Gitlab Phileas Odoo 18.0/odoo/modules/module.py", line 485, in check_python_external_dependency
    version = importlib.metadata.version(requirement.name)
              ^^^^^^^^^^^^^^^^^^^^^^^^^^^^^^^^^^^^^^^^^^^^
  File "/usr/lib/python3.12/importlib/metadata/__init__.py", line 889, in version
    return distribution(distribution_name).version
           ^^^^^^^^^^^^^^^^^^^^^^^^^^^^^^^
  File "/usr/lib/python3.12/importlib/metadata/__init__.py", line 862, in distribution
    return Distribution.from_name(distribution_name)
           ^^^^^^^^^^^^^^^^^^^^^^^^^^^^^^^^^^^^^^^^^
  File "/usr/lib/python3.12/importlib/metadata/__init__.py", line 399, in from_name
    raise PackageNotFoundError(name)
importlib.metadata.PackageNotFoundError: No package metadata was found for py3o.template

The above exception was the direct cause of the following exception:

Traceback (most recent call last):
  File "/data/build/Gitlab Phileas Odoo 18.0/odoo/addons/base/models/ir_module.py", line 359, in check_external_dependencies
    modules.check_manifest_dependencies(terp)
  File "/data/build/Gitlab Phileas Odoo 18.0/odoo/modules/module.py", line 506, in check_manifest_dependencies
    check_python_external_dependency(pydep)
  File "/data/build/Gitlab Phileas Odoo 18.0/odoo/modules/module.py", line 495, in check_python_external_dependency
    raise Exception(msg) from e
Exception: External dependency py3o.template not installed: No package metadata was found for py3o.template

During handling of the above exception, another exception occurred:

Traceback (most recent call last):
  File "/data/build/Gitlab Phileas Odoo 18.0/odoo/service/server.py", line 1366, in preload_registries
    registry = Registry.new(dbname, update_module=update_module)
               ^^^^^^^^^^^^^^^^^^^^^^^^^^^^^^^^^^^^^^^^^^^^^^^^^
  File "/usr/lib/python3/dist-packages/decorator.py", line 232, in fun
    return caller(func, *(extras + args), **kw)
           ^^^^^^^^^^^^^^^^^^^^^^^^^^^^^^^^^^^^
  File "/data/build/Gitlab Phileas Odoo 18.0/odoo/tools/func.py", line 97, in locked
    return func(inst, *args, **kwargs)
           ^^^^^^^^^^^^^^^^^^^^^^^^^^^
  File "/data/build/Gitlab Phileas Odoo 18.0/odoo/modules/registry.py", line 129, in new
    odoo.modules.load_modules(registry, force_demo, status, update_module)
  File "/data/build/Gitlab Phileas Odoo 18.0/odoo/modules/loading.py", line 456, in load_modules
    modules.button_install()
  File "/usr/lib/python3/dist-packages/decorator.py", line 232, in fun
    return caller(func, *(extras + args), **kw)
           ^^^^^^^^^^^^^^^^^^^^^^^^^^^^^^^^^^^^
  File "/data/build/Gitlab Phileas Odoo 18.0/odoo/addons/base/models/ir_module.py", line 76, in check_and_log
    return method(self, *args, **kwargs)
           ^^^^^^^^^^^^^^^^^^^^^^^^^^^^^
  File "/data/build/Gitlab Phileas Odoo 18.0/odoo/addons/base/models/ir_module.py", line 426, in button_install
    modules._state_update('to install', ['uninstalled'])
  File "/data/build/Gitlab Phileas Odoo 18.0/odoo/addons/base/models/ir_module.py", line 395, in _state_update
    update_demo = update_mods._state_update(newstate, states_to_update, level=level-1)
                  ^^^^^^^^^^^^^^^^^^^^^^^^^^^^^^^^^^^^^^^^^^^^^^^^^^^^^^^^^^^^^^^^^^^^
  File "/data/build/Gitlab Phileas Odoo 18.0/odoo/addons/base/models/ir_module.py", line 401, in _state_update
    self.check_external_dependencies(module.name, newstate)
  File "/data/build/Gitlab Phileas Odoo 18.0/odoo/addons/base/models/ir_module.py", line 367, in check_external_dependencies
    raise UserError(msg)
odoo.exceptions.UserError: Unable to install module "report_py3o" because an external dependency is not met: External dependency py3o.template not installed: No package metadata was found for py3o.template
2026-08-31 13:17:33 INFO runbot Getting results for build 00361-master
2026-08-31 13:17:33 Step all finished in 81s
2026-08-31 13:17:33 Starting step run from config Default
2026-08-31 13:17:33 INFO runbot Start running build 00361-master
2026-08-31 13:17:33 Using Dockerfile Tag odoo:minimal_18_0
2026-08-31 13:17:42 INFO server odoo.modules.loading:360 1 modules loaded in 0.06s, 0 queries (+0 extra)
2026-08-31 13:17:43 INFO server odoo.modules.loading:360 13 modules loaded in 0.82s, 0 queries (+0 extra)
2026-08-31 13:23:32 INFO server odoo.modules.loading:360 1 modules loaded in 0.01s, 0 queries (+0 extra)
2026-08-31 13:23:33 INFO server odoo.modules.loading:360 13 modules loaded in 0.01s, 0 queries (+0 extra)
2026-08-31 13:23:44 WARNING server odoo.addons.base.models.ir_cron:158 Skipping database 00361-master-base because of modules to install/upgrade/remove.
2026-08-31 13:24:44 WARNING server odoo.addons.base.models.ir_cron:158 Skipping database 00361-master-base because of modules to install/upgrade/remove.
2026-08-31 13:25:13 ERROR server odoo.addons.account.models.chart_template:246
Error while loading accounting demo data
Traceback (most recent call last):
  File "/data/build/Gitlab Phileas Odoo 18.0/odoo/tools/cache.py", line 103, in lookup
    r = d[key]
        ~^^^^^
  File "/usr/lib/python3/dist-packages/decorator.py", line 232, in fun
    return caller(func, *(extras + args), **kw)
           ^^^^^^^^^^^^^^^^^^^^^^^^^^^^^^^^^^^^
  File "/data/build/Gitlab Phileas Odoo 18.0/odoo/tools/func.py", line 97, in locked
    return func(inst, *args, **kwargs)
           ^^^^^^^^^^^^^^^^^^^^^^^^^^^
  File "/data/build/Gitlab Phileas Odoo 18.0/odoo/tools/lru.py", line 33, in __getitem__
    a = self.d[obj]
        ~~~~~~^^^^^
KeyError: ('ir.model.data', <function IrModelData._xmlid_lookup at 0x7dd3169b1800>, 'base.res_partner_3')

During handling of the above exception, another exception occurred:

Traceback (most recent call last):
  File "/data/build/Gitlab Phileas Odoo 18.0/addons/account/models/chart_template.py", line 243, in _load
    self._install_demo(company.with_env(self.env))
  File "/data/build/Gitlab Phileas Odoo 18.0/addons/account/models/chart_template.py", line 255, in _install_demo
    self.sudo()._load_data(self._get_demo_data(company), ignore_duplicates=True)
                           ^^^^^^^^^^^^^^^^^^^^^^^^^^^^
  File "/data/build/Gitlab Phileas Odoo 18.0/addons/account/demo/account_demo.py", line 22, in _get_demo_data
    'account.move': self._get_demo_data_move(company),
                    ^^^^^^^^^^^^^^^^^^^^^^^^^^^^^^^^^
  File "/data/build/Gitlab Phileas Odoo 18.0/addons/account/demo/account_demo.py", line 136, in _get_demo_data_move
    default_receivable = self.env.ref('base.res_partner_3').with_company(company or self.env.company).property_account_receivable_id
                         ^^^^^^^^^^^^^^^^^^^^^^^^^^^^^^^^^^
  File "/data/build/Gitlab Phileas Odoo 18.0/odoo/api.py", line 660, in ref
    res_model, res_id = self['ir.model.data']._xmlid_to_res_model_res_id(
                        ^^^^^^^^^^^^^^^^^^^^^^^^^^^^^^^^^^^^^^^^^^^^^^^^^
  File "/data/build/Gitlab Phileas Odoo 18.0/odoo/addons/base/models/ir_model.py", line 2268, in _xmlid_to_res_model_res_id
    return self._xmlid_lookup(xmlid)
           ^^^^^^^^^^^^^^^^^^^^^^^^^
  File "/usr/lib/python3/dist-packages/decorator.py", line 232, in fun
    return caller(func, *(extras + args), **kw)
           ^^^^^^^^^^^^^^^^^^^^^^^^^^^^^^^^^^^^
  File "/data/build/Gitlab Phileas Odoo 18.0/odoo/tools/cache.py", line 110, in lookup
    value = d[key] = self.method(*args, **kwargs)
                     ^^^^^^^^^^^^^^^^^^^^^^^^^^^^
  File "/data/build/Gitlab Phileas Odoo 18.0/odoo/addons/base/models/ir_model.py", line 2261, in _xmlid_lookup
    raise ValueError('External ID not found in the system: %s' % xmlid)
ValueError: External ID not found in the system: base.res_partner_3
2026-08-31 13:25:44 WARNING server odoo.addons.base.models.ir_cron:158 Skipping database 00361-master-base because of modules to install/upgrade/remove.
2026-08-31 13:26:25 WARNING server odoo.addons.base.models.ir_ui_view:342 Error-prone use of @class in view tms_account_move_view_form (): use the hasclass(*classes) function to filter elements by their classes
2026-08-31 13:26:46 ERROR server odoo.sql_db:367
bad query: b"UPDATE ir_module_module SET state='uninstalled' WHERE state='to install'"
ERROR: deadlock detected
DETAIL:  Process 1821264 waits for ShareLock on transaction 78211252; blocked by process 1820732.
Process 1820732 waits for ShareLock on transaction 78211256; blocked by process 1821264.
HINT:  See server log for query details.
CONTEXT:  while updating tuple (32,6) in relation "ir_module_module"
2026-08-31 13:26:46 WARNING server odoo.addons.base.models.ir_cron:165
Exception in cron:
Traceback (most recent call last):
  File "/data/build/Gitlab Phileas Odoo 18.0/odoo/addons/base/models/ir_cron.py", line 137, in _process_jobs
    cls._check_modules_state(cron_cr, jobs)
  File "/data/build/Gitlab Phileas Odoo 18.0/odoo/addons/base/models/ir_cron.py", line 210, in _check_modules_state
    odoo.modules.reset_modules_state(cr.dbname)
  File "/data/build/Gitlab Phileas Odoo 18.0/odoo/modules/loading.py", line 644, in reset_modules_state
    cr.execute(
  File "/data/build/Gitlab Phileas Odoo 18.0/odoo/sql_db.py", line 364, in execute
    res = self._obj.execute(query, params)
          ^^^^^^^^^^^^^^^^^^^^^^^^^^^^^^^^
psycopg2.errors.DeadlockDetected: deadlock detected
DETAIL:  Process 1821264 waits for ShareLock on transaction 78211252; blocked by process 1820732.
Process 1820732 waits for ShareLock on transaction 78211256; blocked by process 1821264.
HINT:  See server log for query details.
CONTEXT:  while updating tuple (32,6) in relation "ir_module_module"
2026-08-31 13:27:26 INFO server odoo.modules.loading:360 148 modules loaded in 233.05s, 103020 queries (+103027 extra)
2026-08-31 13:27:46 INFO server odoo.modules.loading:360 1 modules loaded in 0.03s, 0 queries (+0 extra)
2026-08-31 13:27:51 INFO server odoo.modules.loading:360 148 modules loaded in 4.90s, 0 queries (+0 extra)
2026-08-31 14:16:23 WARNING server odoo.http:752 <function odoo.addons.base_import.controllers.main.set_file> called ignoring args {'model', 'ufile'}
2026-08-31 14:16:37 INFO server odoo.modules.loading:360 1 modules loaded in 0.01s, 0 queries (+0 extra)
2026-08-31 14:16:39 INFO server odoo.modules.loading:360 148 modules loaded in 0.12s, 0 queries (+0 extra)
2026-08-31 14:16:44 INFO server odoo.modules.loading:360 154 modules loaded in 5.72s, 755 queries (+755 extra)
2026-08-31 14:16:49 INFO server odoo.modules.loading:360 1 modules loaded in 0.01s, 0 queries (+0 extra)
2026-08-31 14:16:50 INFO server odoo.modules.loading:360 154 modules loaded in 0.13s, 0 queries (+0 extra)
2026-08-31 14:16:54 INFO server odoo.modules.loading:360 1 modules loaded in 0.01s, 0 queries (+0 extra)
2026-08-31 14:16:55 INFO server odoo.modules.loading:360 154 modules loaded in 0.14s, 0 queries (+0 extra)
2026-08-31 14:16:59 INFO server odoo.modules.loading:360 1 modules loaded in 0.01s, 0 queries (+0 extra)
2026-08-31 14:17:00 INFO server odoo.modules.loading:360 154 modules loaded in 0.18s, 0 queries (+0 extra)
2026-08-31 14:17:04 INFO server odoo.modules.loading:360 1 modules loaded in 0.01s, 0 queries (+0 extra)
2026-08-31 14:17:06 INFO server odoo.modules.loading:360 154 modules loaded in 0.15s, 0 queries (+0 extra)
2026-08-31 14:17:28 ERROR server odoo.osv.expression:1183
Non-stored field res.groups.is_visible cannot be searched.
NoneType: None
2026-08-31 14:17:28 ERROR server odoo.osv.expression:1183
Non-stored field res.groups.is_visible cannot be searched.
NoneType: None
2026-08-31 14:17:32 ERROR server odoo.osv.expression:1183
Non-stored field res.groups.is_visible cannot be searched.
NoneType: None
2026-08-31 14:18:05 INFO server odoo.modules.loading:360 1 modules loaded in 0.02s, 0 queries (+0 extra)
2026-08-31 14:18:05 INFO server odoo.modules.loading:360 154 modules loaded in 0.16s, 0 queries (+0 extra)
2026-08-31 14:18:19 WARNING server odoo.http:752 <function odoo.addons.base_import.controllers.main.set_file> called ignoring args {'model', 'ufile'}
2026-08-31 14:18:38 WARNING server odoo.http:752 <function odoo.addons.base_import.controllers.main.set_file> called ignoring args {'model', 'ufile'}
2026-08-31 14:18:56 WARNING server odoo.http:752 <function odoo.addons.base_import.controllers.main.set_file> called ignoring args {'model', 'ufile'}
2026-08-31 14:19:18 ERROR server odoo.osv.expression:1183
Non-stored field res.groups.is_visible cannot be searched.
NoneType: None
2026-08-31 14:19:18 ERROR server odoo.osv.expression:1183
Non-stored field res.groups.is_visible cannot be searched.
NoneType: None
2026-08-31 14:19:24 ERROR server odoo.osv.expression:1183
Non-stored field res.groups.is_visible cannot be searched.
NoneType: None
2026-08-31 14:19:44 WARNING server odoo.http:752 <function odoo.addons.base_import.controllers.main.set_file> called ignoring args {'model', 'ufile'}
2026-08-31 14:19:56 WARNING server odoo.http:752 <function odoo.addons.base_import.controllers.main.set_file> called ignoring args {'model', 'ufile'}
2026-08-31 14:20:14 WARNING server odoo.http:752 <function odoo.addons.base_import.controllers.main.set_file> called ignoring args {'model', 'ufile'}
2026-08-31 14:20:17 ERROR server odoo.sql_db:367
bad query: b'INSERT INTO "tms_geo_entity" ("active", "code", "create_date", "create_uid", "name", "type", "use_on_tariff", "use_on_transport", "write_date", "write_uid") VALUES (true, \'FRA_94\', \'2026-08-31 14:20:16.645496\', 2, \'Val-de-Marne\', \'county\', true, true, \'2026-08-31 14:20:16.645496\', 2), (true, \'FRA_95\', \'2026-08-31 14:20:16.645496\', 2, \'Val-d\'\'Oise\', \'county\', true, true, \'2026-08-31 14:20:16.645496\', 2), (true, \'FRA_20\', \'2026-08-31 14:20:16.645496\', 2, \'Corse\', \'county\', true, true, \'2026-08-31 14:20:16.645496\', 2) RETURNING "id"'
ERROR: duplicate key value violates unique constraint "tms_geo_entity_code_unique"
DETAIL:  Key (code)=(FRA_20) already exists.
2026-08-31 14:20:21 ERROR server odoo.sql_db:367
bad query: b'INSERT INTO "tms_geo_entity" ("active", "code", "create_date", "create_uid", "name", "type", "use_on_tariff", "use_on_transport", "write_date", "write_uid") VALUES (true, \'FRA_94\', \'2026-08-31 14:20:21.833637\', 2, \'Val-de-Marne\', \'county\', true, true, \'2026-08-31 14:20:21.833637\', 2), (true, \'FRA_95\', \'2026-08-31 14:20:21.833637\', 2, \'Val-d\'\'Oise\', \'county\', true, true, \'2026-08-31 14:20:21.833637\', 2), (true, \'FRA_20\', \'2026-08-31 14:20:21.833637\', 2, \'Corse\', \'county\', true, true, \'2026-08-31 14:20:21.833637\', 2) RETURNING "id"'
ERROR: duplicate key value violates unique constraint "tms_geo_entity_code_unique"
DETAIL:  Key (code)=(FRA_20) already exists.
2026-08-31 14:20:35 WARNING server odoo.http:752 <function odoo.addons.base_import.controllers.main.set_file> called ignoring args {'model', 'ufile'}
2026-08-31 14:21:12 ERROR server odoo.osv.expression:1183
Non-stored field tms.postal.address.display_name cannot be searched.
NoneType: None
2026-08-31 14:21:18 ERROR server odoo.osv.expression:1183
Non-stored field tms.postal.address.display_name cannot be searched.
NoneType: None
2026-08-31 14:21:19 ERROR server odoo.osv.expression:1183
Non-stored field tms.postal.address.display_name cannot be searched.
NoneType: None
2026-08-31 14:21:20 ERROR server odoo.osv.expression:1183
Non-stored field tms.postal.address.display_name cannot be searched.
NoneType: None
2026-08-31 14:21:21 ERROR server odoo.osv.expression:1183
Non-stored field tms.postal.address.display_name cannot be searched.
NoneType: None
2026-08-31 14:21:22 ERROR server odoo.osv.expression:1183
Non-stored field tms.postal.address.display_name cannot be searched.
NoneType: None
2026-08-31 14:21:23 ERROR server odoo.osv.expression:1183
Non-stored field tms.postal.address.display_name cannot be searched.
NoneType: None
2026-08-31 14:21:23 WARNING server odoo.models:1862 Cannot execute name_create, no _rec_name defined on tms.postal.address
2026-08-31 14:21:24 ERROR server odoo.osv.expression:1183
Non-stored field tms.postal.address.display_name cannot be searched.
NoneType: None
2026-08-31 14:21:26 ERROR server odoo.osv.expression:1183
Non-stored field tms.postal.address.display_name cannot be searched.
NoneType: None
2026-08-31 14:21:27 ERROR server odoo.osv.expression:1183
Non-stored field tms.postal.address.display_name cannot be searched.
NoneType: None
2026-08-31 14:21:28 ERROR server odoo.osv.expression:1183
Non-stored field tms.postal.address.display_name cannot be searched.
NoneType: None
2026-08-31 14:21:30 ERROR server odoo.osv.expression:1183
Non-stored field tms.postal.address.display_name cannot be searched.
NoneType: None
2026-08-31 14:21:31 ERROR server odoo.osv.expression:1183
Non-stored field tms.postal.address.display_name cannot be searched.
NoneType: None
2026-08-31 14:21:32 ERROR server odoo.osv.expression:1183
Non-stored field tms.postal.address.display_name cannot be searched.
NoneType: None
2026-08-31 14:21:32 ERROR server odoo.osv.expression:1183
Non-stored field tms.postal.address.display_name cannot be searched.
NoneType: None
2026-08-31 14:21:32 ERROR server odoo.osv.expression:1183
Non-stored field tms.postal.address.display_name cannot be searched.
NoneType: None
2026-08-31 14:21:33 ERROR server odoo.osv.expression:1183
Non-stored field tms.postal.address.display_name cannot be searched.
NoneType: None
2026-08-31 14:21:33 ERROR server odoo.osv.expression:1183
Non-stored field tms.postal.address.display_name cannot be searched.
NoneType: None
2026-08-31 14:21:33 ERROR server odoo.osv.expression:1183
Non-stored field tms.postal.address.display_name cannot be searched.
NoneType: None
2026-08-31 14:21:34 ERROR server odoo.osv.expression:1183
Non-stored field tms.postal.address.display_name cannot be searched.
NoneType: None
2026-08-31 14:21:34 ERROR server odoo.osv.expression:1183
Non-stored field tms.postal.address.display_name cannot be searched.
NoneType: None
2026-08-31 14:21:34 ERROR server odoo.osv.expression:1183
Non-stored field tms.postal.address.display_name cannot be searched.
NoneType: None
2026-08-31 14:21:36 ERROR server odoo.osv.expression:1183
Non-stored field tms.postal.address.display_name cannot be searched.
NoneType: None
2026-08-31 14:21:37 WARNING server odoo.models:1862 Cannot execute name_create, no _rec_name defined on tms.postal.address
2026-08-31 14:21:40 ERROR server odoo.osv.expression:1183
Non-stored field tms.postal.address.display_name cannot be searched.
NoneType: None
2026-08-31 14:21:52 ERROR server odoo.osv.expression:1183
Non-stored field tms.postal.address.display_name cannot be searched.
NoneType: None
2026-08-31 14:21:59 ERROR server odoo.osv.expression:1183
Non-stored field tms.postal.address.display_name cannot be searched.
NoneType: None
2026-08-31 14:22:03 ERROR server odoo.osv.expression:1183
Non-stored field tms.postal.address.display_name cannot be searched.
NoneType: None
2026-08-31 14:22:46 WARNING server odoo.tools.view_validation:315 <string>:1:0:ERROR:RELAXNGV:RELAXNG_ERR_NOELEM: Expecting an element header, got nothing
2026-08-31 14:22:46 WARNING server odoo.tools.view_validation:315 <string>:1:0:ERROR:RELAXNGV:RELAXNG_ERR_INVALIDATTR: Invalid attribute Create for element list
2026-08-31 14:22:46 WARNING server odoo.tools.view_validation:281 Invalid XML: Get RNG validator and validate RNG file.
2026-08-31 14:22:46 WARNING server odoo.http:2609 Définition de vue tms_view_tms_address_tree (tms_views.tms_view_tms_address_tree) invalide dans tms_views/views/tms_address.xml
2026-08-31 14:22:58 WARNING server odoo.tools.view_validation:315 <string>:1:0:ERROR:RELAXNGV:RELAXNG_ERR_NOELEM: Expecting an element header, got nothing
2026-08-31 14:22:58 WARNING server odoo.tools.view_validation:315 <string>:1:0:ERROR:RELAXNGV:RELAXNG_ERR_INVALIDATTR: Invalid attribute Create for element list
2026-08-31 14:22:58 WARNING server odoo.tools.view_validation:281 Invalid XML: Get RNG validator and validate RNG file.
2026-08-31 14:22:58 WARNING server odoo.http:2609 Définition de vue tms_view_tms_address_tree (tms_views.tms_view_tms_address_tree) invalide dans tms_views/views/tms_address.xml
2026-08-31 14:24:20 ERROR server odoo.osv.expression:1183
Non-stored field res.groups.is_visible cannot be searched.
NoneType: None
2026-08-31 14:24:20 ERROR server odoo.osv.expression:1183
Non-stored field res.groups.is_visible cannot be searched.
NoneType: None
2026-08-31 14:24:23 ERROR server odoo.osv.expression:1183
Non-stored field res.groups.is_visible cannot be searched.
NoneType: None
2026-08-31 14:24:25 ERROR server odoo.osv.expression:1183
Non-stored field res.groups.is_visible cannot be searched.
NoneType: None
2026-08-31 14:24:25 ERROR server odoo.osv.expression:1183
Non-stored field res.groups.is_visible cannot be searched.
NoneType: None
2026-08-31 14:24:27 ERROR server odoo.osv.expression:1183
Non-stored field res.groups.is_visible cannot be searched.
NoneType: None
2026-08-31 14:55:21 WARNING server odoo.http:2609
Vous n'êtes pas autorisé à créer des enregistrements 'Name search address model to save requests use for Geo Address research' (tms.name.search.address).

Cette opération est autorisée pour les groupes suivants :
	- Settings/Name Search Address manager
	- Settings/Name Search Address user

Contactez votre administrateur pour demander l'accès si nécessaire.
2026-08-31 14:55:42 ERROR server odoo.osv.expression:1183
Non-stored field res.groups.is_visible cannot be searched.
NoneType: None
2026-08-31 14:55:42 ERROR server odoo.osv.expression:1183
Non-stored field res.groups.is_visible cannot be searched.
NoneType: None
2026-08-31 14:55:45 ERROR server odoo.osv.expression:1183
Non-stored field res.groups.is_visible cannot be searched.
NoneType: None
2026-08-31 14:55:47 ERROR server odoo.osv.expression:1183
Non-stored field res.groups.is_visible cannot be searched.
NoneType: None
2026-08-31 14:55:47 ERROR server odoo.osv.expression:1183
Non-stored field res.groups.is_visible cannot be searched.
NoneType: None
2026-08-31 14:55:50 ERROR server odoo.osv.expression:1183
Non-stored field res.groups.is_visible cannot be searched.
NoneType: None
2026-08-31 14:56:08 WARNING server odoo.http:2609
Vous n'êtes pas autorisé à créer des enregistrements 'Name search address model to save requests use for Geo Address research' (tms.name.search.address).

Cette opération est autorisée pour les groupes suivants :
	- Settings/Name Search Address manager
	- Settings/Name Search Address user

Contactez votre administrateur pour demander l'accès si nécessaire.
2026-08-31 14:56:19 ERROR server odoo.osv.expression:1183
Non-stored field res.groups.is_visible cannot be searched.
NoneType: None
2026-08-31 14:56:29 ERROR server odoo.osv.expression:1183
Non-stored field res.groups.is_visible cannot be searched.
NoneType: None
2026-08-31 14:56:29 ERROR server odoo.osv.expression:1183
Non-stored field res.groups.is_visible cannot be searched.
NoneType: None
2026-08-31 14:56:36 ERROR server odoo.osv.expression:1183
Non-stored field res.groups.is_visible cannot be searched.
NoneType: None
2026-08-31 14:57:36 ERROR server odoo.osv.expression:1183
Non-stored field tms.postal.address.display_name cannot be searched.
NoneType: None
2026-08-31 14:58:23 Log limit reached (full logs are still available in the log file)